{"text_format":"1","workbook":"xlsx","n_sheets":17,"sheets":["Instructions","Inputs","Outputs","Print Inputs","Print Outputs A","Print Outputs B","Print Outputs C","Suggested Equipment","Equipment List","Equipment","Standardized Milk","EmployeeCost","Milk Pricing","NPV_own","NPV_eff","NPV_econ","NPV_basic"],"not_rendered":{"charts":0,"images":4,"macros":1,"external_links":0,"defined_names":91,"comments":0,"pivot_tables":0},"unopened":[],"bounds":{"document_bytes":16777216,"sheet_cells":100000,"rows_first":2000,"rows_last":500,"rows_between":2000,"halvings":0,"cell_chars":16384,"cell_head_chars":4096},"cells_cut":0,"cells_raw":0,"read":"whole","date_system":"1900"}

{"sheet":"Instructions","index":0,"n_rows":47,"n_cols":8,"rows_kept":47,"cut":false,"hidden":false,"merged":[[0,3,0,6],[0,7,2,9],[0,0,2,2],[6,3,6,6],[8,0,11,9],[13,0,13,9],[14,0,14,9],[3,0,3,9],[4,3,4,6],[5,3,5,6],[15,0,15,9],[16,0,16,9],[17,0,17,9],[19,0,19,9],[21,0,21,9],[20,0,20,9],[28,0,29,9],[30,0,30,9],[31,0,31,9],[35,0,35,9],[22,0,22,9],[23,0,23,9],[24,0,24,9],[25,0,25,9],[26,0,26,9],[46,0,49,9],[39,7,44,9],[40,0,41,6],[42,0,42,6],[43,0,43,6],[44,0,44,6]]}
[{"$error":"#VALUE!"},null,null,"Value-Added Dairy Processing \nDecision Making Tool: \nBottled Milk",null,null,null,{"$error":"#VALUE!"}]
[]
[]
["Created by:"]
[null,null,null,"Caitlin Zaring Weir, Post Doctoral Fellow"]
[null,null,null,"Liz Eckelkamp, Associate Professor & State Dairy Extension Specialist"]
{"$rows_left_out":42}
{"sheet":"Inputs","index":1,"n_rows":99,"n_cols":5,"rows_kept":99,"cut":false,"hidden":false,"merged":[[0,0,0,4],[2,0,2,1],[13,0,13,1],[25,0,25,1],[33,0,33,1],[98,0,98,4],[38,4,38,6],[41,4,41,6],[56,0,56,1],[47,0,47,4],[39,0,39,1],[39,2,40,3],[39,4,39,6],[80,0,80,1],[40,4,40,6],[93,0,93,4],[89,0,89,4]]}
["The grey cells have data entered that can be used or adjusted to better fit your operation. The pre-populated data consists of averages or benchmarks provided by a comprehensive survey of Tennessee value-added dairies. "]
[]
["Herd and Milk Production Related Information",null,"Assumed Fat Percentages within Components"]
[null,null,"*If you test components, you can adjust fat percentages, otherwise, assume these fat percentages"]
["Herd Size - All Cows",300,null,"Fat Content"]
["Average production per animal per day",80,"Cream",0.4]
{"$rows_left_out":94}
{"sheet":"Outputs","index":2,"n_rows":51,"n_cols":7,"rows_kept":51,"cut":false,"hidden":false,"merged":[[43,0,45,6],[50,0,50,6],[36,1,38,5],[0,0,3,6],[22,0,22,6],[5,0,5,2],[29,0,32,6]]}
["This 'Outputs' sheet shows how much of each milk type you can produce and your potential to grow processing capacity based on equipment package option. It calculates how many pounds of milk you need to process daily to meet your selected processing percentages."]
[]
[]
[]
[]
["Milk Type and Quantity Amounts:\n*Values are presented per day"]
{"$rows_left_out":46}
{"sheet":"Print Inputs","index":3,"n_rows":75,"n_cols":4,"rows_kept":75,"cut":false,"hidden":true,"merged":[[39,3,41,3],[39,1,41,2],[28,2,29,3],[39,0,41,0],[0,0,0,2],[1,0,1,1]]}
["Inputs"]
["Herd and Milk Production Related Information"]
["Herd Size - All Cows",{"$f":"Inputs!B5","v":300}]
["Average production per cow per day",{"$f":"Inputs!B6","v":80}]
["Average fat%",{"$f":"Inputs!B7","v":4.0500000000000001E-2}]
["Average protein %",{"$f":"Inputs!B8","v":3.7999999999999999E-2}]
{"$rows_left_out":70}
{"sheet":"Print Outputs A","index":4,"n_rows":25,"n_cols":5,"rows_kept":25,"cut":false,"hidden":true,"merged":[[0,0,1,4],[24,0,26,4]]}
["This sheet shows how much of each milk type you can produce and your potential to grow processing capacity based on equipment package option. It calculates how many pounds of milk you need to process daily to meet your selected processing percentages."]
[]
["Milk Type","Gallons/Day","Liters/Day","Percent of Actual Raw Milk Used"]
["Whole Milk",{"$f":"'Standardized Milk'!$J$19","v":102.93686492548797},{"$f":"'Standardized Milk'!$F$19","v":27.193042870679658},{"$f":"'Standardized Milk'!$H$35","v":0.22040816326530613}]
["Reduced Fat Milk",{"$f":"'Standardized Milk'!$J$16","v":0},{"$f":"'Standardized Milk'!$F$16","v":0},{"$f":"'Standardized Milk'!$I$35","v":0}]
["Lowfat Milk",{"$f":"'Standardized Milk'!$J$13","v":0},{"$f":"'Standardized Milk'!$F$13","v":0},{"$f":"'Standardized Milk'!$J$35","v":0}]
{"$rows_left_out":20}
{"sheet":"Print Outputs B","index":5,"n_rows":39,"n_cols":7,"rows_kept":39,"cut":false,"hidden":true,"merged":[[0,0,4,6]]}
["This sheet compares four equipment packages: your choice list from the inputs sheet, the most efficient combination, the most economical combination, and a basic pasteurizer and bottler combination. For each, it shows total cost, processing time (not including cleanup time), payback period (years to breakeven), net present value (NPV), and internal rate of return (IRR). Payback period represents the number of years it will take to overcome the initial investment cost and begin to return a profit. Net present value represents the total value of your investment over time, in other words, how much more you would earn compared to the alternative (not processing). Internal rate of return tells you how fast your money is expected to grow with the investment in a bottled milk operation. Lower payback period and larger net present values and internal rate of returns are best. "]
[]
[]
[]
[]
["Your Choice Equipment List","Equipment Description","Equipment Cost","Time Required","Capacity Utilized","Extra Capacity","Extra Capacity"]
{"$rows_left_out":34}
{"sheet":"Print Outputs C","index":6,"n_rows":67,"n_cols":6,"rows_kept":67,"cut":false,"hidden":true,"merged":[[0,0,1,5],[47,0,47,5],[58,0,58,5],[2,0,2,5],[23,0,23,5],[36,0,36,5]]}
["This sheet presents all available pasteurizers, separators, homogenizers, and bottlers used in this tool, sorted from shortest to longest run-times. It includes estimated cost as well as processing and growth capacities."]
[]
["Vat Pasteurizers"]
[null,"Total Run Time","Equipment Cost","Capacity Utilized","Extra Capcity","Extra Capacity"]
[{"$f":"IFERROR(INDEX(Equipment!$A$22:$J$38,MATCH('Equipment List'!$B$8,Equipment!$K$22:$K$38,0),1),\"\")","v":"ANCO Equipment (2000 gal. capacity)"},{"$f":"IF(SMALL(Equipment!$K$22:$K$38,1),SMALL(Equipment!$K$22:$K$38,1),Equipment!$T$13)","v":"00:28:01.302"},{"$f":"IFERROR(INDEX(Equipment!$A$22:$J$38,MATCH('Equipment List'!$B$8,Equipment!$K$22:$K$38,0),5),\"\")","v":56000},{"$f":"IFERROR(INDEX(Equipment!$A$22:$J$38,MATCH('Equipment List'!$B$8,Equipment!$K$22:$K$38,0),6),\"\")","v":1.9459515360142399E-2},{"$f":"TEXT(IFERROR(INDEX(Equipment!$A$22:$J$38,MATCH('Equipment List'!$B$8,Equipment!$K$22:$K$38,0),9),\"\"),\"0.00\")&\" lbs/day\"","v":"674.61 lbs/day"},{"$f":"TEXT(IFERROR(ROUNDDOWN(INDEX(Equipment!$A$22:$J$38,MATCH('Equipment List'!$B$8,Equipment!$K$22:$K$38,0),10),0),\"\"),\"0\")&\" cows\"","v":"2529 cows"}]
[{"$f":"IFERROR(INDEX(Equipment!$A$22:$J$38,MATCH('Equipment List'!$B$9,Equipment!$K$22:$K$38,0),1),\"\")","v":"ANCO Equipment (1500 gal. capacity)"},{"$f":"IF(SMALL(Equipment!$K$22:$K$38,1),SMALL(Equipment!$K$22:$K$38,2),Equipment!$T$13)","v":"00:37:21.736"},{"$f":"IFERROR(INDEX(Equipment!$A$22:$J$38,MATCH('Equipment List'!$B$9,Equipment!$K$22:$K$38,0),5),\"\")","v":49500},{"$f":"IFERROR(INDEX(Equipment!$A$22:$J$38,MATCH('Equipment List'!$B$9,Equipment!$K$22:$K$38,0),6),\"\")","v":2.5946020480189867E-2},{"$f":"TEXT(IFERROR(INDEX(Equipment!$A$22:$J$38,MATCH('Equipment List'!$B$9,Equipment!$K$22:$K$38,0),9),\"\"),\"0.00\")&\" lbs/day\"","v":"502.61 lbs/day"},{"$f":"TEXT(IFERROR(ROUNDDOWN(INDEX(Equipment!$A$22:$J$38,MATCH('Equipment List'!$B$9,Equipment!$K$22:$K$38,0),10),0),\"\"),\"0\")&\" cows\"","v":"1884 cows"}]
{"$rows_left_out":62}
{"sheet":"Suggested Equipment","index":7,"n_rows":65,"n_cols":7,"rows_kept":65,"cut":false,"hidden":false,"merged":[[0,0,9,6],[64,0,64,6]]}
["This 'Suggested Equipment' sheet compares four equipment packages: your choice list from the inputs sheet, the most efficient combination, the most economical combination, and a basic pasteurizer and bottler combination. For each, it shows total cost, processing time (not including cleanup time), payback period (years to breakeven), net present value (NPV), and internal rate of return (IRR). Payback period represents the number of years it will take to overcome the initial investment cost and begin to return a profit. Net present value represents the total value of your investment over time, in other words, how much more you would earn compared to the alternative (not processing). Internal rate of return tells you how fast your money is expected to grow with the investment in a bottled milk operation. Lower payback period and larger net present values and internal rate of returns are best. "]
[]
[]
[]
[]
[]
{"$rows_left_out":60}
{"sheet":"Equipment List","index":8,"n_rows":79,"n_cols":6,"rows_kept":79,"cut":false,"hidden":false,"merged":[[78,0,78,6],[62,0,62,5],[0,0,3,5],[5,0,5,5],[26,0,26,5],[40,0,40,5],[51,0,51,5]]}
["This 'Equipment List' sheet presents all available pasteurizers, separators, homogenizers, and bottlers used in this tool, sorted from shortest to longest run-times. It includes estimated cost as well as processing and growth capacities."]
[]
[]
[]
[]
["Vat Pasteurizers"]
{"$rows_left_out":74}
{"sheet":"Equipment","index":9,"n_rows":126,"n_cols":40,"rows_kept":126,"cut":false,"hidden":true,"merged":[]}
["Inputs",null,null,null,null,null,null,null,null,null,null,null,null,null,null,null,null,null,null,null,null,null,null,"Numbers from SDBII Grant Quotes","Equipment Item","Item Category","Sum","Count","Average Quote Cost",null,null,null,null,null,null,null,null,null,null,1]
["Herdsize - All Cows",{"$f":"Inputs!B5","v":300},null,null,null,"right now, do for 24 hour period",null,null,null,null,null,null,null,null,null,null,null,null,null,null,null,null,null,null,"butter churn","butter",61805.56,2,30902.78,null,null,null,null,null,null,null,null,null,null,2]
["Average production per cow",{"$f":"Inputs!B6","v":80},null,null,null,null,null,null,null,null,null,null,null,null,null,null,null,null,null,null,null,null,null,null,"other butter","butter",600,2,300,null,null,null,null,null,null,null,null,null,null,3]
["Average fat%",{"$f":"Inputs!B7","v":4.0500000000000001E-2},null,null,null,null,null,null,null,null,null,null,null,null,null,null,null,null,null,null,null,null,null,null,"Total Butter",null,{"$f":"AA2+AA3","v":62405.56},{"$f":"AB2+AB3","v":4},{"$f":"AA4/AB4","v":15601.39},null,null,null,null,null,null,null,null,null,null,4]
["Average protein %",{"$f":"Inputs!B8","v":3.7999999999999999E-2},null,null,null,null,null,null,null,null,null,null,null,null,null,null,null,null,null,null,null,null,null,null,"cheese brine tank","cheese",44794,3,14931.333333333334,null,null,null,null,null,null,null,null,null,null,5]
["How many months do you milk each year",{"$f":"Inputs!B9","v":12},null,null,null,null,null,null,null,null,null,null,null,null,null,null,null,null,null,null,null,null,null,null,"cheese drain table","cheese",194970.48,9,21663.386666666669,null,null,null,null,null,null,null,null,null,null,6]
{"$rows_left_out":121}
{"sheet":"Standardized Milk","index":10,"n_rows":56,"n_cols":14,"rows_kept":56,"cut":false,"hidden":true,"merged":[[36,6,36,13],[5,5,5,7],[5,9,5,11],[25,6,25,13]]}
[null,"Volume in L/d","Volume in gal/d","Fat Percent"]
["Total Raw Product",{"$f":"Equipment!B18","v":123.37584265400956},{"$f":"Equipment!B14","v":467.02836864341759},{"$f":"Inputs!B7","v":4.0500000000000001E-2}]
["Total Raw Product designated for standardized milks",{"$f":"B2*B9","v":61.68792132700478},{"$f":"C2*B9","v":233.5141843217088}]
["Cream designated for standardized milks",{"$f":"G8","v":6.1765127736675618},{"$f":"K8","v":23.380644237467713},{"$f":"Inputs!D6","v":0.4},"this does not include creamline %"]
["Skim designated for standardized milks",{"$f":"H8","v":55.511408553337219},{"$f":"L8","v":210.13354008424108},{"$f":"Inputs!D7","v":5.0000000000000001E-4}]
[null,null,null,null,null,"Liters",null,null,null,"Gallons"]
{"$rows_left_out":51}
{"sheet":"EmployeeCost","index":11,"n_rows":2,"n_cols":4,"rows_kept":2,"cut":false,"hidden":false,"merged":[]}
["Employee","Name","Hourly Wage ($)","Hours per Week"]
[0,"Test Employee",0,0]

{"sheet":"Milk Pricing","index":12,"n_rows":211,"n_cols":29,"rows_kept":211,"cut":false,"hidden":true,"merged":[[0,23,0,24],[201,3,201,6],[201,7,201,10],[201,11,201,12],[193,3,193,6],[193,7,193,10],[193,11,193,14],[193,15,193,18],[193,19,193,22],[193,23,193,24],[0,19,0,22],[0,3,0,6],[0,7,0,10],[0,11,0,14],[0,15,0,18]]}
[null,null,null,"Whole Milk",null,null,null,"Reduced Fat Milk",null,null,null,"Lowfat Milk",null,null,null,"Skim Milk",null,null,null,"Cream",null,null,null,"Butter",null,null,"Walmart","365 by Whole Foods","21 stores"]
["Store","Brand","Specialty","Gallons","Half Gallons","Quarts","Pints","Gallons","Half Gallons","Quarts","Pints","Gallons","Half Gallons","Quarts","Pints","Gallons","Half Gallons","Quarts","Pints","Gallons","Half Gallons","Quarts","Pints","8 oz","16 oz",null,"Kroger","A2","73 brands"]
["Krog.","A2",null,null,5.29,null,null,null,5.29,null,null,null,null,null,null,null,null,null,null,null,null,null,null,null,null,null,"Costco","Alexandre Family Farms"]
["Krog.","Challenge",null,null,null,null,null,null,null,null,null,null,null,null,null,null,null,null,null,null,null,null,null,5.49,5.49,null,"Albertson","Banner"]
["Krog.","Country Crock",null,null,null,null,null,null,null,null,null,null,null,null,null,null,null,null,null,null,null,null,4.1900000000000004,null,null,null,"Publix","Borden"]
["Krog.","Dairy Pure",null,null,null,null,null,null,null,2.69,null,null,null,null,null,null,null,null,null,null,null,8.49,5.99,null,null,null,"Trader Joe's","Cabot"]
{"$rows_left_out":206}
{"sheet":"NPV_own","index":13,"n_rows":65,"n_cols":27,"rows_kept":65,"cut":false,"hidden":true,"merged":[]}
[null,null,null,null,null,null,"Year 0 (investment year)","Year 1","Year 2","Year 3","Year 4","Year 5","Year 6","Year 7","Year 8","Year 9","Year 10","Year 11","Year 12","Year 13","Year 14","Year 15","Year 16","Year 17","Year 18","Year 19","Year 20"]
["equipment cost",{"$f":"'Suggested Equipment'!B20+'Suggested Equipment'!B21","v":220600},null,null,null,"Change in Revenue"]
["cost to build",{"$f":"Inputs!B36","v":220857},null,null,null,"Product sold (in gallons)",null,{"$f":"B47*365.25","v":165503.90625},{"$f":"H3","v":165503.90625},{"$f":"I3","v":165503.90625},165503.90625,165503.90625,165503.90625,165503.90625,165503.90625,165503.90625,165503.90625,165503.90625,165503.90625,165503.90625,165503.90625,165503.90625,165503.90625,165503.90625,165503.90625,{"$f":"Y3","v":165503.90625},165503.90625]
[null,null,null,null,null,"Product revenue ($/unit)",null,{"$f":"(SUM(D41:D44)*365.25)","v":1639654.7324999999},{"$f":"H4","v":1639654.7324999999},1639654.7324999999,1639654.7324999999,1639654.7324999999,1639654.7324999999,1639654.7324999999,1639654.7324999999,1639654.7324999999,1639654.7324999999,1639654.7324999999,1639654.7324999999,1639654.7324999999,1639654.7324999999,1639654.7324999999,1639654.7324999999,1639654.7324999999,1639654.7324999999,1639654.7324999999,1639654.7324999999]
["total investment",{"$f":"SUM(B2:B3)","v":441457},null,null,null,"Opportunity cost of raw product ($/cwt)"]
[null,null,null,null,null,"Value of remaining raw product ($/cwt)",null,{"$f":"B22","v":1363142.1240246408},{"$f":"H6","v":1363142.1240246408},{"$f":"I6","v":1363142.1240246408},1363142.1240246408,1363142.1240246408,1363142.1240246408,1363142.1240246408,1363142.1240246408,1363142.1240246408,1363142.1240246408,1363142.1240246408,1363142.1240246408,1363142.1240246408,1363142.1240246408,1363142.1240246408,1363142.1240246408,1363142.1240246408,1363142.1240246408,{"$f":"Y6","v":1363142.1240246408},1363142.1240246408]
{"$rows_left_out":60}
{"sheet":"NPV_eff","index":14,"n_rows":65,"n_cols":27,"rows_kept":65,"cut":false,"hidden":true,"merged":[]}
[null,null,null,null,null,null,"Year 0 (investment year)","Year 1","Year 2","Year 3","Year 4","Year 5","Year 6","Year 7","Year 8","Year 9","Year 10","Year 11","Year 12","Year 13","Year 14","Year 15","Year 16","Year 17","Year 18","Year 19","Year 20"]
["equipment cost",{"$f":"'Suggested Equipment'!B32+'Suggested Equipment'!B33","v":1122740},null,null,null,"Change in Revenue"]
["cost to build",{"$f":"Inputs!B36","v":220857},null,null,null,"Product sold (in gallons)",null,{"$f":"B47*365.25","v":165503.90625},{"$f":"H3","v":165503.90625},{"$f":"I3","v":165503.90625},165503.90625,165503.90625,165503.90625,165503.90625,165503.90625,165503.90625,165503.90625,165503.90625,165503.90625,165503.90625,165503.90625,165503.90625,165503.90625,165503.90625,165503.90625,{"$f":"Y3","v":165503.90625},165503.90625]
[null,null,null,null,null,"Product revenue ($/unit)",null,{"$f":"(SUM(D41:D44)*365.25)","v":1639654.7324999999},{"$f":"H4","v":1639654.7324999999},1639654.7324999999,1639654.7324999999,1639654.7324999999,1639654.7324999999,1639654.7324999999,1639654.7324999999,1639654.7324999999,1639654.7324999999,1639654.7324999999,1639654.7324999999,1639654.7324999999,1639654.7324999999,1639654.7324999999,1639654.7324999999,1639654.7324999999,1639654.7324999999,1639654.7324999999,1639654.7324999999]
["total investment",{"$f":"SUM(B2:B3)","v":1343597},null,null,null,"Opportunity cost of raw product ($/cwt)"]
[null,null,null,null,null,"Value of remaining raw product ($/cwt)",null,{"$f":"B22","v":1363142.1240246408},{"$f":"H6","v":1363142.1240246408},{"$f":"I6","v":1363142.1240246408},1363142.1240246408,1363142.1240246408,1363142.1240246408,1363142.1240246408,1363142.1240246408,1363142.1240246408,1363142.1240246408,1363142.1240246408,1363142.1240246408,1363142.1240246408,1363142.1240246408,1363142.1240246408,1363142.1240246408,1363142.1240246408,1363142.1240246408,{"$f":"Y6","v":1363142.1240246408},1363142.1240246408]
{"$rows_left_out":60}
{"sheet":"NPV_econ","index":15,"n_rows":65,"n_cols":27,"rows_kept":65,"cut":false,"hidden":true,"merged":[]}
[null,null,null,null,null,null,"Year 0 (investment year)","Year 1","Year 2","Year 3","Year 4","Year 5","Year 6","Year 7","Year 8","Year 9","Year 10","Year 11","Year 12","Year 13","Year 14","Year 15","Year 16","Year 17","Year 18","Year 19","Year 20"]
["equipment cost",{"$f":"'Suggested Equipment'!B44+'Suggested Equipment'!B45","v":1026740},null,null,null,"Change in Revenue"]
["cost to build",{"$f":"Inputs!B36","v":220857},null,null,null,"Product sold (in gallons)",null,{"$f":"B47*365.25","v":165503.90625},{"$f":"H3","v":165503.90625},{"$f":"I3","v":165503.90625},165503.90625,165503.90625,165503.90625,165503.90625,165503.90625,165503.90625,165503.90625,165503.90625,165503.90625,165503.90625,165503.90625,165503.90625,165503.90625,165503.90625,165503.90625,{"$f":"Y3","v":165503.90625},165503.90625]
[null,null,null,null,null,"Product revenue ($/unit)",null,{"$f":"SUM(D41:D44)*365.25","v":1639654.7324999999},{"$f":"H4","v":1639654.7324999999},1639654.7324999999,1639654.7324999999,1639654.7324999999,1639654.7324999999,1639654.7324999999,1639654.7324999999,1639654.7324999999,1639654.7324999999,1639654.7324999999,1639654.7324999999,1639654.7324999999,1639654.7324999999,1639654.7324999999,1639654.7324999999,1639654.7324999999,1639654.7324999999,1639654.7324999999,1639654.7324999999]
["total investment",{"$f":"SUM(B2:B3)","v":1247597},null,null,null,"Opportunity cost of raw product ($/cwt)"]
[null,null,null,null,null,"Value of remaining raw product ($/cwt)",null,{"$f":"B22","v":1363142.1240246408},{"$f":"H6","v":1363142.1240246408},{"$f":"I6","v":1363142.1240246408},1363142.1240246408,1363142.1240246408,1363142.1240246408,1363142.1240246408,1363142.1240246408,1363142.1240246408,1363142.1240246408,1363142.1240246408,1363142.1240246408,1363142.1240246408,1363142.1240246408,1363142.1240246408,1363142.1240246408,1363142.1240246408,1363142.1240246408,{"$f":"Y6","v":1363142.1240246408},1363142.1240246408]
{"$rows_left_out":60}
{"sheet":"NPV_basic","index":16,"n_rows":65,"n_cols":27,"rows_kept":65,"cut":false,"hidden":true,"merged":[]}
[null,null,null,null,null,null,"Year 0 (investment year)","Year 1","Year 2","Year 3","Year 4","Year 5","Year 6","Year 7","Year 8","Year 9","Year 10","Year 11","Year 12","Year 13","Year 14","Year 15","Year 16","Year 17","Year 18","Year 19","Year 20"]
["equipment cost",{"$f":"'Suggested Equipment'!B54+'Suggested Equipment'!B55","v":716600},null,null,null,"Change in Revenue"]
["cost to build",{"$f":"Inputs!B36","v":220857},null,null,null,"Product sold (in gallons)",null,{"$f":"B47*365.25","v":165503.90625},{"$f":"H3","v":165503.90625},{"$f":"I3","v":165503.90625},165503.90625,165503.90625,165503.90625,165503.90625,165503.90625,165503.90625,165503.90625,165503.90625,165503.90625,165503.90625,165503.90625,165503.90625,165503.90625,165503.90625,165503.90625,{"$f":"Y3","v":165503.90625},165503.90625]
[null,null,null,null,null,"Product revenue ($/unit)",null,{"$f":"SUM(D41:D44)*365.25","v":1639654.7324999999},{"$f":"H4","v":1639654.7324999999},1639654.7324999999,1639654.7324999999,1639654.7324999999,1639654.7324999999,1639654.7324999999,1639654.7324999999,1639654.7324999999,1639654.7324999999,1639654.7324999999,1639654.7324999999,1639654.7324999999,1639654.7324999999,1639654.7324999999,1639654.7324999999,1639654.7324999999,1639654.7324999999,1639654.7324999999,1639654.7324999999]
["total investment",{"$f":"SUM(B2:B3)","v":937457},null,null,null,"Opportunity cost of raw product ($/cwt)"]
[null,null,null,null,null,"Value of remaining raw product ($/cwt)",null,{"$f":"B22","v":1363142.1240246408},{"$f":"H6","v":1363142.1240246408},{"$f":"I6","v":1363142.1240246408},1363142.1240246408,1363142.1240246408,1363142.1240246408,1363142.1240246408,1363142.1240246408,1363142.1240246408,1363142.1240246408,1363142.1240246408,1363142.1240246408,1363142.1240246408,1363142.1240246408,1363142.1240246408,1363142.1240246408,1363142.1240246408,1363142.1240246408,{"$f":"Y6","v":1363142.1240246408},1363142.1240246408]
{"$rows_left_out":59}